[Gluster-Maintainers] Build failed in Jenkins: netbsd-periodic #318

jenkins at build.gluster.org jenkins at build.gluster.org
Mon Oct 2 10:01:06 UTC 2017


See <https://build.gluster.org/job/netbsd-periodic/318/display/redirect>

------------------------------------------
[...truncated 333.25 KB...]
ok 20, LINENUM:62
ok 21, LINENUM:63
ok 22, LINENUM:64
ok 23, LINENUM:65
ok 24, LINENUM:66
ok 25, LINENUM:67
ok 26, LINENUM:68
ok 27, LINENUM:69
ok 28, LINENUM:72
ok 29, LINENUM:75
ok 30, LINENUM:76
ok 31, LINENUM:78
ok 32, LINENUM:79
ok
All tests successful.
Files=1, Tests=32, 49 wallclock secs ( 0.02 usr  0.03 sys +  2.43 cusr 12.27 csys = 14.75 CPU)
Result: PASS
End of test ./tests/basic/mount.t
================================================================================


================================================================================
[09:53:19] Running tests in file ./tests/basic/mpx-compat.t
./tests/basic/mpx-compat.t .. 
1..11
ok 1, LINENUM:19
ok 2, LINENUM:20
ok 3, LINENUM:25
ok 4, LINENUM:26
ok 5, LINENUM:29
ok 6, LINENUM:30
ok 7, LINENUM:36
ok 8, LINENUM:39
ok 9, LINENUM:40
ok 10, LINENUM:41
ok 11, LINENUM:44
volume set: success
ok
All tests successful.
Files=1, Tests=11, 49 wallclock secs ( 0.03 usr  0.02 sys +  1.68 cusr  7.18 csys =  8.91 CPU)
Result: PASS
End of test ./tests/basic/mpx-compat.t
================================================================================


================================================================================
[09:54:08] Running tests in file ./tests/basic/multiplex.t
ERROR: failed to create logfile "/dev/stderr" (Permission denied)
ERROR: failed to create logfile "/dev/stderr" (Permission denied)
./tests/basic/multiplex.t .. 
1..32
ok 1, LINENUM:22
ok 2, LINENUM:23
ok 3, LINENUM:27
ok 4, LINENUM:28
ok 5, LINENUM:30
ok 6, LINENUM:32
ok 7, LINENUM:33
ok 8, LINENUM:35
ok 9, LINENUM:37
ok 10, LINENUM:38
ok 11, LINENUM:39
ok 12, LINENUM:40
ok 13, LINENUM:41
ok 14, LINENUM:43
ok 15, LINENUM:44
ok 16, LINENUM:46
ok 17, LINENUM:48
ok 18, LINENUM:49
ok 19, LINENUM:50
ok 20, LINENUM:54
ok 21, LINENUM:55
ok 22, LINENUM:56
ok 23, LINENUM:57
ok 24, LINENUM:58
ok 25, LINENUM:59
ok 26, LINENUM:62
ok 27, LINENUM:66
ok 28, LINENUM:72
ok 29, LINENUM:73
ok 30, LINENUM:76
ok 31, LINENUM:77
not ok 32 Got "2" instead of "1", LINENUM:78
FAILED COMMAND: 1 count_brick_processes
volume set: success
Failed 1/32 subtests 

Test Summary Report
-------------------
./tests/basic/multiplex.t (Wstat: 0 Tests: 32 Failed: 1)
  Failed test:  32
Files=1, Tests=32, 55 wallclock secs ( 0.04 usr  0.00 sys +  3.18 cusr 23.77 csys = 26.99 CPU)
Result: FAIL
./tests/basic/multiplex.t: bad status 1

       *********************************
       *       REGRESSION FAILED       *
       * Retrying failed tests in case *
       * we got some spurious failures *
       *********************************

ERROR: failed to create logfile "/dev/stderr" (Permission denied)
ERROR: failed to create logfile "/dev/stderr" (Permission denied)
./tests/basic/multiplex.t .. 
1..32
ok 1, LINENUM:22
ok 2, LINENUM:23
ok 3, LINENUM:27
ok 4, LINENUM:28
ok 5, LINENUM:30
ok 6, LINENUM:32
ok 7, LINENUM:33
ok 8, LINENUM:35
ok 9, LINENUM:37
ok 10, LINENUM:38
ok 11, LINENUM:39
ok 12, LINENUM:40
ok 13, LINENUM:41
ok 14, LINENUM:43
ok 15, LINENUM:44
ok 16, LINENUM:46
ok 17, LINENUM:48
ok 18, LINENUM:49
ok 19, LINENUM:50
ok 20, LINENUM:54
ok 21, LINENUM:55
ok 22, LINENUM:56
ok 23, LINENUM:57
ok 24, LINENUM:58
ok 25, LINENUM:59
ok 26, LINENUM:62
ok 27, LINENUM:66
ok 28, LINENUM:72
ok 29, LINENUM:73
ok 30, LINENUM:76
ok 31, LINENUM:77
not ok 32 Got "2" instead of "1", LINENUM:78
FAILED COMMAND: 1 count_brick_processes
volume set: success
Failed 1/32 subtests 

Test Summary Report
-------------------
./tests/basic/multiplex.t (Wstat: 0 Tests: 32 Failed: 1)
  Failed test:  32
Files=1, Tests=32, 59 wallclock secs ( 0.05 usr  0.01 sys +  3.21 cusr 26.08 csys = 29.35 CPU)
Result: FAIL
End of test ./tests/basic/multiplex.t
================================================================================


Run complete
================================================================================
Number of tests found:                             84
Number of tests selected for run based on pattern: 84
Number of tests skipped as they were marked bad:   5
Number of tests skipped because of known_issues:   3
Number of tests that were run:                     76

Tests ordered by time taken, slowest to fastest: 
================================================================================
./tests/basic/distribute/rebal-all-nodes-migrate.t  -  1422 second
./tests/basic/afr/lk-quorum.t  -  265 second
./tests/basic/afr/split-brain-favorite-child-policy.t  -  259 second
./tests/basic/afr/gfid-mismatch-resolution-with-fav-child-policy.t  -  166 second
./tests/basic/afr/self-heal.t  -  152 second
./tests/basic/afr/sparse-file-self-heal.t  -  152 second
./tests/basic/afr/self-heald.t  -  151 second
./tests/basic/afr/gfid-mismatch-resolution-with-cli.t  -  119 second
./tests/basic/afr/split-brain-heal-info.t  -  100 second
./tests/basic/afr/entry-self-heal.t  -  100 second
./tests/basic/mgmt_v3-locks.t  -  83 second
./tests/basic/afr/inodelk.t  -  78 second
./tests/basic/afr/quorum.t  -  71 second
./tests/basic/afr/metadata-self-heal.t  -  70 second
./tests/basic/mount-nfs-auth.t  -  64 second
./tests/basic/afr/arbiter-add-brick.t  -  61 second
./tests/basic/geo-replication/marker-xattrs.t  -  58 second
./tests/basic/afr/split-brain-healing.t  -  58 second
./tests/basic/multiplex.t  -  55 second
./tests/basic/glusterd/volfile_server_switch.t  -  53 second
./tests/basic/afr/arbiter.t  -  52 second
./tests/basic/mpx-compat.t  -  49 second
./tests/basic/mount.t  -  49 second
./tests/basic/meta.t  -  49 second
./tests/basic/glusterd/heald.t  -  45 second
./tests/basic/afr/granular-esh/conservative-merge.t  -  39 second
./tests/basic/glusterd/arbiter-volume-probe.t  -  36 second
./tests/basic/afr/gfid-self-heal.t  -  36 second
./tests/basic/afr/durability-off.t  -  36 second
./tests/basic/afr/arbiter-mount.t  -  35 second
./tests/basic/afr/split-brain-resolution.t  -  33 second
./tests/basic/afr/client-side-heal.t  -  32 second
./tests/basic/afr/heal-quota.t  -  30 second
./tests/basic/afr/granular-esh/replace-brick.t  -  29 second
./tests/basic/afr/granular-esh/granular-esh.t  -  29 second
./tests/basic/afr/granular-esh/granular-indices-but-non-granular-heal.t  -  28 second
./tests/basic/afr/replace-brick-self-heal.t  -  28 second
./tests/basic/afr/read-subvol-data.t  -  26 second
./tests/basic/afr/root-squash-self-heal.t  -  26 second
./tests/basic/afr/add-brick-self-heal.t  -  26 second
./tests/basic/afr/granular-esh/add-brick.t  -  26 second
./tests/basic/fop-sampling.t  -  25 second
./tests/basic/afr/resolve.t  -  25 second
./tests/basic/glusterd/disperse-create.t  -  25 second
./tests/basic/afr/arbiter-remove-brick.t  -  24 second
./tests/basic/afr/data-self-heal.t  -  22 second
./tests/basic/gfid-access.t  -  22 second
./tests/basic/cdc.t  -  21 second
./tests/basic/afr/stale-file-lookup.t  -  21 second
./tests/basic/afr/read-subvol-entry.t  -  20 second
./tests/basic/afr/gfid-heal.t  -  18 second
./tests/basic/distribute/throttle-rebal.t  -  18 second
./tests/basic/afr/heal-info.t  -  17 second
./tests/basic/fops-sanity.t  -  16 second
./tests/basic/distribute/bug-1265677-use-readdirp.t  -  15 second
./tests/basic/glusterd/arbiter-volume.t  -  15 second
./tests/basic/md-cache/bug-1317785.t  -  15 second
./tests/basic/afr/arbiter-statfs.t  -  15 second
./tests/basic/afr/compounded-write-txns.t  -  14 second
./tests/basic/gfapi/anonymous_fd.t  -  13 second
./tests/basic/gfapi/gfapi-dup.t  -  13 second
./tests/basic/afr/gfid-mismatch.t  -  13 second
./tests/basic/gfapi/upcall-cache-invalidate.t  -  13 second
./tests/basic/gfapi/bug-1241104.t  -  12 second
./tests/basic/gfapi/gfapi-load-volfile.t  -  12 second
./tests/basic/gfapi/glfs_sysrq.t  -  12 second
./tests/basic/gfapi/gfapi-async-calls-test.t  -  12 second
./tests/basic/gfapi/libgfapi-fini-hang.t  -  11 second
./tests/basic/md-cache/bug-1418249.t  -  11 second
./tests/basic/gfapi/gfapi-trunc.t  -  10 second
./tests/basic/afr/arbiter-cli.t  -  7 second
./tests/basic/exports_parsing.t  -  2 second
./tests/basic/gfapi/sink.t  -  2 second
./tests/basic/bd.t  -  1 second
./tests/basic/0symbol-check.t  -  0 second
./tests/basic/first-test.t  -  0 second

1 test(s) failed 
./tests/basic/multiplex.t

0 test(s) generated core 


Result is 1

tar: Removing leading / from absolute path names in the archive
Logs archived in http://nbslave72.cloud.gluster.org/archives/logs/glusterfs-logs-20171002083532.tgz
Build step 'Execute shell' marked build as failure


More information about the maintainers mailing list