[Gluster-devel] Change #18681 has broken build on master

Raghavendra Gowdappa rgowdapp at redhat.com
Tue Nov 7 11:12:57 UTC 2017

Please check [1].

Build on master branch on my laptop failed too:

[raghu at unused server]$ make > /dev/null
server.c: In function 'init':
server.c:1205:9: error: too few arguments to function 'rpcsvc_program_register'
In file included from server.h:17:0,
                 from server.c:16:
../../../../rpc/rpc-lib/src/rpcsvc.h:426:1: note: declared here
make[1]: *** [server.lo] Error 1
make: *** [all-recursive] Error 1

The change was introduced by [2]. However, the puzzling thing is [2] itself was built successfully and has passed all tests. Wondering how did that happen.

[1] https://build.gluster.org/job/centos6-regression/7281/console
[2] review.gluster.org/18681


More information about the Gluster-devel mailing list