[Gluster-devel] build failure

Emmanuel Dreyfus manu at netbsd.org
Wed Feb 12 09:48:56 UTC 2014

Anyone can explain me why this one fails?

build console is below. It builds at mine, of course...

libtool: install: warning: relinking `template.la'
chown: changing ownership of `/build/install/bin/fusermount-glusterfs':
Operation not permitted
0:40: error: libglusterfs/src/glusterfs.h: No such file or directory
1:38: error: libglusterfs/src/syscall.h: No such file or directory
cc1: warnings being treated as errors
In function 'main':
0: error: implicit declaration of function 'sys_lsetxattr'
make[2]: *** [gsync_sync_gfid-gsync-sync-gfid.o] Error 1
make[1]: *** [install-recursive] Error 1
make: *** [install-recursive] Error 1
Build step 'Execute shell' marked build as failure
Finished: FAILURE

Emmanuel Dreyfus
manu at netbsd.org

More information about the Gluster-devel mailing list