[CI-results] Build failed in Jenkins: gluster_anteater_gcs #457

ci at centos.org ci at centos.org
Fri Feb 28 00:40:25 UTC 2020


See <https://ci.centos.org/job/gluster_anteater_gcs/457/display/redirect>

------------------------------------------
[...truncated 294.77 KB...]

TASK [kubernetes/preinstall : Remove kubespray specific config from dhclient config] ***
Friday 28 February 2020  00:40:07 +0000 (0:00:00.225)       0:02:36.158 ******* 

TASK [kubernetes/preinstall : Remove kubespray specific dhclient hook] *********
Friday 28 February 2020  00:40:08 +0000 (0:00:00.229)       0:02:36.388 ******* 
ok: [kube1]
ok: [kube2]
ok: [kube3]

TASK [kubernetes/preinstall : Check if we are running inside a Azure VM] *******
Friday 28 February 2020  00:40:09 +0000 (0:00:01.053)       0:02:37.441 ******* 
ok: [kube1]
ok: [kube3]
ok: [kube2]

TASK [kubernetes/preinstall : install growpart] ********************************
Friday 28 February 2020  00:40:10 +0000 (0:00:01.011)       0:02:38.453 ******* 

TASK [kubernetes/preinstall : check if growpart needs to be run] ***************
Friday 28 February 2020  00:40:10 +0000 (0:00:00.251)       0:02:38.704 ******* 

TASK [kubernetes/preinstall : check fs type] ***********************************
Friday 28 February 2020  00:40:10 +0000 (0:00:00.224)       0:02:38.929 ******* 

TASK [kubernetes/preinstall : run growpart] ************************************
Friday 28 February 2020  00:40:10 +0000 (0:00:00.216)       0:02:39.145 ******* 

TASK [kubernetes/preinstall : run xfs_growfs] **********************************
Friday 28 February 2020  00:40:11 +0000 (0:00:00.220)       0:02:39.366 ******* 

TASK [container-engine/cri-o : gather os specific variables] *******************
Friday 28 February 2020  00:40:11 +0000 (0:00:00.230)       0:02:39.596 ******* 

TASK [container-engine/cri-o : Add OpenShift Origin repository] ****************
Friday 28 February 2020  00:40:11 +0000 (0:00:00.274)       0:02:39.871 ******* 

TASK [container-engine/cri-o : Make sure needed folders exist in the system] ***
Friday 28 February 2020  00:40:11 +0000 (0:00:00.222)       0:02:40.094 ******* 

TASK [container-engine/cri-o : Install cri-o packages] *************************
Friday 28 February 2020  00:40:12 +0000 (0:00:00.310)       0:02:40.404 ******* 

TASK [container-engine/cri-o : Install cri-o config] ***************************
Friday 28 February 2020  00:40:12 +0000 (0:00:00.210)       0:02:40.615 ******* 

TASK [container-engine/cri-o : Copy mounts.conf] *******************************
Friday 28 February 2020  00:40:12 +0000 (0:00:00.229)       0:02:40.845 ******* 

TASK [container-engine/cri-o : Create directory for oci hooks] *****************
Friday 28 February 2020  00:40:12 +0000 (0:00:00.222)       0:02:41.068 ******* 

TASK [container-engine/cri-o : Install cri-o service] **************************
Friday 28 February 2020  00:40:13 +0000 (0:00:00.217)       0:02:41.285 ******* 

TASK [container-engine/rkt : gather os specific variables for rkt] *************
Friday 28 February 2020  00:40:13 +0000 (0:00:00.229)       0:02:41.515 ******* 

TASK [container-engine/rkt : install rkt pkg on ubuntu] ************************
Friday 28 February 2020  00:40:13 +0000 (0:00:00.265)       0:02:41.781 ******* 

TASK [container-engine/rkt : install rkt pkg on fedora] ************************
Friday 28 February 2020  00:40:13 +0000 (0:00:00.216)       0:02:41.998 ******* 

TASK [container-engine/rkt : install rkt pkg on centos] ************************
Friday 28 February 2020  00:40:14 +0000 (0:00:00.230)       0:02:42.228 ******* 

TASK [container-engine/rkt : install rkt pkg on openSUSE] **********************
Friday 28 February 2020  00:40:14 +0000 (0:00:00.223)       0:02:42.452 ******* 

TASK [container-engine/rkt : Set up cron job to do garbage cleanup] ************
Friday 28 February 2020  00:40:14 +0000 (0:00:00.224)       0:02:42.677 ******* 

TASK [container-engine/docker-storage : docker-storage-setup | install git and make] ***
Friday 28 February 2020  00:40:14 +0000 (0:00:00.218)       0:02:42.895 ******* 

TASK [container-engine/docker-storage : docker-storage-setup | docker-storage-setup sysconfig template] ***
Friday 28 February 2020  00:40:14 +0000 (0:00:00.260)       0:02:43.156 ******* 

TASK [container-engine/docker-storage : docker-storage-override-directory | docker service storage-setup override dir] ***
Friday 28 February 2020  00:40:15 +0000 (0:00:00.230)       0:02:43.387 ******* 

TASK [container-engine/docker-storage : docker-storage-override | docker service storage-setup override file] ***
Friday 28 February 2020  00:40:15 +0000 (0:00:00.227)       0:02:43.615 ******* 

TASK [container-engine/docker-storage : docker-storage-setup | install lvm2] ***
Friday 28 February 2020  00:40:15 +0000 (0:00:00.230)       0:02:43.845 ******* 

TASK [container-engine/docker-storage : docker-storage-setup | install and run container-storage-setup] ***
Friday 28 February 2020  00:40:15 +0000 (0:00:00.231)       0:02:44.076 ******* 

TASK [container-engine/docker : check if atomic host] **************************
Friday 28 February 2020  00:40:16 +0000 (0:00:00.221)       0:02:44.298 ******* 
ok: [kube1]
ok: [kube2]
ok: [kube3]

TASK [container-engine/docker : set_fact] **************************************
Friday 28 February 2020  00:40:17 +0000 (0:00:01.014)       0:02:45.313 ******* 
ok: [kube1]
ok: [kube2]
ok: [kube3]

TASK [container-engine/docker : gather os specific variables] ******************
Friday 28 February 2020  00:40:17 +0000 (0:00:00.364)       0:02:45.677 ******* 
ok: [kube1] => (item=/root/gcs/deploy/kubespray/roles/container-engine/docker/vars/../vars/redhat.yml)
ok: [kube2] => (item=/root/gcs/deploy/kubespray/roles/container-engine/docker/vars/../vars/redhat.yml)
ok: [kube3] => (item=/root/gcs/deploy/kubespray/roles/container-engine/docker/vars/../vars/redhat.yml)

TASK [container-engine/docker : Warn about Docker version on SUSE] *************
Friday 28 February 2020  00:40:17 +0000 (0:00:00.452)       0:02:46.130 ******* 

TASK [container-engine/docker : include_tasks] *********************************
Friday 28 February 2020  00:40:18 +0000 (0:00:00.236)       0:02:46.367 ******* 
included: /root/gcs/deploy/kubespray/roles/container-engine/docker/tasks/set_facts_dns.yml for kube1, kube2, kube3

TASK [container-engine/docker : set dns server for docker] *********************
Friday 28 February 2020  00:40:18 +0000 (0:00:00.504)       0:02:46.871 ******* 
ok: [kube1]
ok: [kube2]
ok: [kube3]

TASK [container-engine/docker : show docker_dns_servers] ***********************
Friday 28 February 2020  00:40:19 +0000 (0:00:00.307)       0:02:47.178 ******* 
ok: [kube1] => {
    "msg": []
}
ok: [kube2] => {
    "msg": []
}
ok: [kube3] => {
    "msg": []
}

TASK [container-engine/docker : set base docker dns facts] *********************
Friday 28 February 2020  00:40:19 +0000 (0:00:00.295)       0:02:47.474 ******* 
ok: [kube1]
ok: [kube2]
ok: [kube3]

TASK [container-engine/docker : add upstream dns servers (only when dnsmasq is not used)] ***
Friday 28 February 2020  00:40:19 +0000 (0:00:00.305)       0:02:47.780 ******* 
ok: [kube1]
ok: [kube2]
ok: [kube3]

TASK [container-engine/docker : add global searchdomains] **********************
Friday 28 February 2020  00:40:19 +0000 (0:00:00.374)       0:02:48.154 ******* 
ok: [kube1]
ok: [kube2]
ok: [kube3]

TASK [container-engine/docker : check system nameservers] **********************
Friday 28 February 2020  00:40:20 +0000 (0:00:00.305)       0:02:48.460 ******* 
ok: [kube1]
ok: [kube2]
ok: [kube3]

TASK [container-engine/docker : check system search domains] *******************
Friday 28 February 2020  00:40:21 +0000 (0:00:00.991)       0:02:49.452 ******* 
ok: [kube1]
ok: [kube2]
ok: [kube3]

TASK [container-engine/docker : add system nameservers to docker options] ******
Friday 28 February 2020  00:40:22 +0000 (0:00:01.052)       0:02:50.505 ******* 
ok: [kube1]
ok: [kube2]
ok: [kube3]

TASK [container-engine/docker : add system search domains to docker options] ***
Friday 28 February 2020  00:40:22 +0000 (0:00:00.340)       0:02:50.845 ******* 

TASK [container-engine/docker : check number of nameservers] *******************
Friday 28 February 2020  00:40:22 +0000 (0:00:00.272)       0:02:51.118 ******* 

TASK [container-engine/docker : rtrim number of nameservers to 3] **************
Friday 28 February 2020  00:40:23 +0000 (0:00:00.233)       0:02:51.352 ******* 

TASK [container-engine/docker : check number of search domains] ****************
Friday 28 February 2020  00:40:23 +0000 (0:00:00.235)       0:02:51.587 ******* 

TASK [container-engine/docker : check length of search domains] ****************
Friday 28 February 2020  00:40:23 +0000 (0:00:00.230)       0:02:51.818 ******* 

TASK [container-engine/docker : check for minimum kernel version] **************
Friday 28 February 2020  00:40:23 +0000 (0:00:00.240)       0:02:52.058 ******* 

TASK [container-engine/docker : Ensure old versions of Docker are not installed. | Debian] ***
Friday 28 February 2020  00:40:24 +0000 (0:00:00.233)       0:02:52.292 ******* 

TASK [container-engine/docker : Ensure old versions of Docker are not installed. | RedHat] ***
Friday 28 February 2020  00:40:24 +0000 (0:00:00.512)       0:02:52.805 ******* 
fatal: [kube1]: FAILED! => {"msg": "The conditional check '(docker_versioned_pkg[docker_version | string] | search('docker-ce'))' failed. The error was: template error while templating string: no filter named 'search'. String: {% if (docker_versioned_pkg[docker_version | string] | search('docker-ce')) %} True {% else %} False {% endif %}\n\nThe error appears to be in '/root/gcs/deploy/kubespray/roles/container-engine/docker/tasks/pre-upgrade.yml': line 14, column 3, but may\nbe elsewhere in the file depending on the exact syntax problem.\n\nThe offending line appears to be:\n\n\n- name: Ensure old versions of Docker are not installed. | RedHat\n  ^ here\n"}
fatal: [kube2]: FAILED! => {"msg": "The conditional check '(docker_versioned_pkg[docker_version | string] | search('docker-ce'))' failed. The error was: template error while templating string: no filter named 'search'. String: {% if (docker_versioned_pkg[docker_version | string] | search('docker-ce')) %} True {% else %} False {% endif %}\n\nThe error appears to be in '/root/gcs/deploy/kubespray/roles/container-engine/docker/tasks/pre-upgrade.yml': line 14, column 3, but may\nbe elsewhere in the file depending on the exact syntax problem.\n\nThe offending line appears to be:\n\n\n- name: Ensure old versions of Docker are not installed. | RedHat\n  ^ here\n"}
fatal: [kube3]: FAILED! => {"msg": "The conditional check '(docker_versioned_pkg[docker_version | string] | search('docker-ce'))' failed. The error was: template error while templating string: no filter named 'search'. String: {% if (docker_versioned_pkg[docker_version | string] | search('docker-ce')) %} True {% else %} False {% endif %}\n\nThe error appears to be in '/root/gcs/deploy/kubespray/roles/container-engine/docker/tasks/pre-upgrade.yml': line 14, column 3, but may\nbe elsewhere in the file depending on the exact syntax problem.\n\nThe offending line appears to be:\n\n\n- name: Ensure old versions of Docker are not installed. | RedHat\n  ^ here\n"}

NO MORE HOSTS LEFT *************************************************************

PLAY RECAP *********************************************************************
kube1                      : ok=92   changed=14   unreachable=0    failed=1    skipped=94   rescued=0    ignored=0   
kube2                      : ok=80   changed=14   unreachable=0    failed=1    skipped=90   rescued=0    ignored=0   
kube3                      : ok=78   changed=14   unreachable=0    failed=1    skipped=92   rescued=0    ignored=0   

Friday 28 February 2020  00:40:24 +0000 (0:00:00.233)       0:02:53.038 ******* 
=============================================================================== 
Install packages ------------------------------------------------------- 33.35s
Wait for host to be available ------------------------------------------ 20.40s
gather facts from all instances ---------------------------------------- 16.90s
Persist loaded modules -------------------------------------------------- 6.19s
kubernetes/preinstall : Create kubernetes directories ------------------- 4.02s
Load required kernel modules -------------------------------------------- 2.77s
bootstrap-os : Gather nodes hostnames ----------------------------------- 2.76s
bootstrap-os : Assign inventory name to unconfigured hostnames (non-CoreOS and Tumbleweed) --- 2.74s
kubernetes/preinstall : Create cni directories -------------------------- 2.55s
Extend root VG ---------------------------------------------------------- 2.44s
kubernetes/preinstall : Remove swapfile from /etc/fstab ----------------- 2.21s
kubernetes/preinstall : Hosts | populate inventory into hosts file ------ 2.08s
bootstrap-os : Disable fastestmirror plugin ----------------------------- 2.08s
download : Sync container ----------------------------------------------- 2.02s
download : Download items ----------------------------------------------- 1.98s
bootstrap-os : Create remote_tmp for it is used by another module ------- 1.97s
Extend the root LV and FS to occupy remaining space --------------------- 1.94s
kubernetes/preinstall : Set selinux policy ------------------------------ 1.91s
Gathering Facts --------------------------------------------------------- 1.90s
kubernetes/preinstall : Hosts | Update (if necessary) hosts file -------- 1.87s
==> kube3: An error occurred. The error will be shown after all tasks complete.
An error occurred while executing multiple actions in parallel.
Any errors that occurred are shown below.

An error occurred while executing the action on the 'kube3'
machine. Please handle this error then try again:

Ansible failed to complete successfully. Any error output should be
visible above. Please fix these errors and try again.
Build step 'Execute shell' marked build as failure
Performing Post build task...
Could not match :Build started  : False
Logical operation result is FALSE
Skipping script  : # cico-node-done-from-ansible.sh
# A script that releases nodes from a SSID file written by
SSID_FILE=${SSID_FILE:-$WORKSPACE/cico-ssid}

for ssid in $(cat ${SSID_FILE})
do
    cico -q node done $ssid
done

END OF POST BUILD TASK 	: 0


More information about the ci-results mailing list